Target
N-formyl peptide receptor 2
Ligand
BDBM350578
Substrate
Meas. Tech.
FLIPR
EC50
103000±n/a nM
Citation
 Beard, RLDonello, JEViswanath, V Use of agonists of formyl peptide receptor 2 for treating ocular inflammatory diseases US Patent  US10208071 Publication Date 2/19/2019 
Target
Name:
N-formyl peptide receptor 2
Synonyms:
ALXR, FPRL1, FPR2 FPR2 FPRH1 Formyl Peptide Receptor-Like 1 LXA4 receptor Lipoxin A4 receptor RFP | hFPRL
Type:
G Protein-Coupled Receptor (GPCR)
Mol. Mass.:
38968.35
Organism:
Homo sapiens (Human)
Description:
P25090
Residue:
351
  
Inhibitor
Name:
BDBM350578
Synonyms:
(+) tert-butyl {3-[(3R)-3-(4- cyanophenyl)-7-({[4- (methylsulfinyl)phenyl] carbamoyl}amino)-1-oxo- 3,4-dihydroisoquinolin-2(1H)-yl] propyl}carbamate US10434112, Compound 40 | US10799518, Compound 40
Type:
Small organic molecule
Emp. Form.:
C32H35N5O5S
Mol. Mass.:
601.716
SMILES:
CS(=O)c1ccc(NC(=O)Nc2ccc3CC(N(CCCNC(=O)OC(C)(C)C)C(=O)c3c2)c2ccc(cc2)C#N)cc1
: