Target
N-formyl peptide receptor 2
Ligand
BDBM350662
Substrate
Meas. Tech.
FLIPR
EC50
1800±n/a nM
Citation
 Beard, RLDonello, JEViswanath, V Use of agonists of formyl peptide receptor 2 for treating ocular inflammatory diseases US Patent  US10208071 Publication Date 2/19/2019 
Target
Name:
N-formyl peptide receptor 2
Synonyms:
ALXR, FPRL1, FPR2 FPR2 FPRH1 Formyl Peptide Receptor-Like 1 LXA4 receptor Lipoxin A4 receptor RFP | hFPRL
Type:
G Protein-Coupled Receptor (GPCR)
Mol. Mass.:
38968.35
Organism:
Homo sapiens (Human)
Description:
P25090
Residue:
351
  
Inhibitor
Name:
BDBM350662
Synonyms:
US10208071, Compound 124 {[(2S)-4-methyl-2-({[4- (trifluoromethyl)phenyl]carbamoyl} amino)pentanoyl]amino}acetic acid
Type:
Small organic molecule
Emp. Form.:
C16H20F3N3O4
Mol. Mass.:
375.3429
SMILES:
CC(C)C[C@H](NC(=O)Nc1ccc(cc1)C(F)(F)F)C(=O)NCC(O)=O
: