Target
Bile acid receptor
Ligand
BDBM350736
Substrate
Meas. Tech.
Human FXR (NR1H4) Assay
EC50
5500±n/a nM
Citation
 Wang, GOr, YSShen, RLong, JDai, PXing, XHe, J Bile acid derivatives as FXR/TGR5 agonists and methods of use thereof US Patent  US10208081 Publication Date 2/19/2019 
Target
Name:
Bile acid receptor
Synonyms:
BAR FXR HRR1 NR1H4_HUMAN RIP14 Retinoid X receptor-interacting protein 14 | farnesoid x receptor
Type:
Nuclear Receptor
Mol. Mass.:
55916.24
Organism:
Homo sapiens (Human)
Description:
Q96RI1
Residue:
486
  
Inhibitor
Name:
BDBM350736
Synonyms:
US10208081, Example 45
Type:
Small organic molecule
Emp. Form.:
C33H58N2O4S
Mol. Mass.:
578.89
SMILES:
CC[C@H]1C[C@H]2[C@@H]3CC[C@H]([C@H](C)C[C@H](C)NC(=O)NS(=O)(=O)C4CCCCC4)[C@@]3(C)CC[C@@H]2[C@@]2(C)CC[C@@H](O)C[C@@H]12
: