Target
Bile acid receptor
Ligand
BDBM350816
Substrate
Meas. Tech.
Human FXR (NR1H4) Assay
EC50
5500±n/a nM
Citation
 Wang, GOr, YSShen, RLong, JDai, PXing, XHe, J Bile acid derivatives as FXR/TGR5 agonists and methods of use thereof US Patent  US10208081 Publication Date 2/19/2019 
Target
Name:
Bile acid receptor
Synonyms:
BAR FXR HRR1 NR1H4_HUMAN RIP14 Retinoid X receptor-interacting protein 14 | farnesoid x receptor
Type:
Nuclear Receptor
Mol. Mass.:
55916.24
Organism:
Homo sapiens (Human)
Description:
Q96RI1
Residue:
486
  
Inhibitor
Name:
BDBM350816
Synonyms:
US10208081, Example 125
Type:
Small organic molecule
Emp. Form.:
C27H49N3O5S
Mol. Mass.:
527.76
SMILES:
CC[C@H]1[C@@H](O)[C@H]2[C@@H]3CC[C@H]([C@H](C)CCNC(=O)NS(=O)(=O)NC)[C@@]3(C)CC[C@@H]2[C@@]2(C)CC[C@@H](O)C[C@@H]12
: