Target
Dihydroorotate dehydrogenase (quinone), mitochondrial
Ligand
BDBM16094
Substrate
BDBM14700
Meas. Tech.
DHODH Inhibition Assay
pH
8±n/a
Temperature
298.15±n/a K
Ki
700±n/a nM
IC50
5000±1600 nM
Km
15000±n/a nM
Citation
 Heikkila, TThirumalairajan, SDavies, MParsons, MRMcConkey, AGFishwick, CWJohnson, AP The first de novo designed inhibitors of Plasmodium falciparum dihydroorotate dehydrogenase. Bioorg Med Chem Lett 16:88-92 (2006)  
Target
Name:
Dihydroorotate dehydrogenase (quinone), mitochondrial
Synonyms:
DHODH Dihydroorotate dehydrogenase Dihydroorotate dehydrogenase, mitochondrial Dihydroorotate oxidase (DHODH) | PYRD_HUMAN
Type:
Enzyme
Mol. Mass.:
42881.33
Organism:
Homo sapiens (Human)
Description:
Q02127
Residue:
395
  
Inhibitor
Name:
BDBM16094
Synonyms:
2-[(4-phenylbenzene)amido]benzoic acid Inhibitor 2
Type:
Small organic molecule
Emp. Form.:
C20H15NO3
Mol. Mass.:
317.338
SMILES:
OC(=O)c1ccccc1NC(=O)c1ccc(cc1)-c1ccccc1
:
Substrate
Name:
BDBM14700
Synonyms:
2,3-dimethoxy-5-methyl-6-decyl-1,4-benzoquinone Decylubiquinone
Type:
Ubiquinone analog
Emp. Form.:
C19H30O4
Mol. Mass.:
322.4391
SMILES:
CCCCCCCCC=Cc1c(C)c(O)c(OC)c(OC)c1O
: