Target
Dihydroorotate dehydrogenase (quinone), mitochondrial
Ligand
BDBM16103
Substrate
BDBM16100
Meas. Tech.
DHODH Inhibition Assay
pH
8±n/a
Temperature
295.15±n/a K
Ki
3700±900 nM
Km
6600±700 nM
kcat
15.4±0.2 1/sec
Comments
Mixed inhibition.
Citation
 Hurt, DESutton, AEClardy, J Brequinar derivatives and species-specific drug design for dihydroorotate dehydrogenase. Bioorg Med Chem Lett 16:1610-5 (2006)  
Target
Name:
Dihydroorotate dehydrogenase (quinone), mitochondrial
Synonyms:
DHODH Dihydroorotate dehydrogenase Dihydroorotate dehydrogenase, mitochondrial Dihydroorotate oxidase (DHODH) | PYRD_HUMAN
Type:
Enzyme
Mol. Mass.:
42881.33
Organism:
Homo sapiens (Human)
Description:
Q02127
Residue:
395
  
Inhibitor
Name:
BDBM16103
Synonyms:
3-carbamoyl-5-[3-(3-methylphenyl)phenyl]benzoic acid AMX08 | Brequinar-derived asymmetric terphenyl compound
Type:
Small organic molecule
Emp. Form.:
C21H17NO3
Mol. Mass.:
331.3646
SMILES:
Cc1cccc(c1)-c1cccc(c1)-c1cc(cc(c1)C(O)=O)C(N)=O
:
Substrate
Name:
BDBM16100
Synonyms:
2,3-dimethoxy-5-methyl-6-(3-methyl-2-butenyl)-1,4-benzoquinone Coenzyme Q1 | Ubiquinone 5
Type:
Small organic molecule
Emp. Form.:
C14H18O4
Mol. Mass.:
250.2903
SMILES:
[#6]-[#8]-[#6]-1=[#6](-[#8]-[#6])-[#6](=O)-[#6](-[#6]\[#6]=[#6](\[#6])-[#6])=[#6](-[#6])-[#6]-1=O
: