Target
Dihydroorotate dehydrogenase (quinone), mitochondrial [30-395]
Ligand
BDBM16111
Substrate
BDBM16110
Meas. Tech.
DHODH Inhibition Assay
pH
8±n/a
Temperature
298.15±n/a K
IC50
134±n/a nM
Citation
 Leban, JKralik, MMies, JBaumgartner, RGassen, MTasler, S Biphenyl-4-ylcarbamoyl thiophene carboxylic acids as potent DHODH inhibitors. Bioorg Med Chem Lett 16:267-70 (2006)  
Target
Name:
Dihydroorotate dehydrogenase (quinone), mitochondrial [30-395]
Synonyms:
DHODH Dihydroorotate Dehydrogenase (DHODH) Dihydroorotate oxidase | PYRD_HUMAN
Type:
Enzyme
Mol. Mass.:
39678.95
Organism:
Homo sapiens (Human)
Description:
Recombinant human DHODH (amino acids 30 to 395) was cloned and expressed in E. coli.
Residue:
366
  
Inhibitor
Name:
BDBM16111
Synonyms:
2-{[2-fluoro-4-(3-methoxyphenyl)phenyl]carbamoyl}cyclopent-1-ene-1-carboxylic acid CHEMBL197194
Type:
Small organic molecule
Emp. Form.:
C20H18FNO4
Mol. Mass.:
355.3596
SMILES:
COc1cccc(c1)-c1ccc(NC(=O)C2=C(CCC2)C(O)=O)c(F)c1
:
Substrate
Name:
BDBM16110
Synonyms:
2-[(2E,6E,10E,14E,18E)-3,7,11,15,19,23-hexamethyltetracosa-2,6,10,14,18,22-hexaen-1-yl]-5,6-dimethoxy-3-methylcyclohexa-2,5-diene-1,4-dione Coenzyme Q6 | Ubiquinone 6
Type:
Emp. Form.:
C39H58O4
Mol. Mass.:
590.8754
SMILES:
[#6]-[#8]-[#6]-1=[#6](-[#8]-[#6])-[#6](=O)-[#6](-[#6]-[#6]=[#6](-[#6])-[#6]-[#6]\[#6]=[#6](/[#6])-[#6]-[#6]\[#6]=[#6](/[#6])-[#6]-[#6]\[#6]=[#6](/[#6])-[#6]-[#6]\[#6]=[#6](/[#6])-[#6]-[#6]\[#6]=[#6](/[#6])-[#6])=[#6](-[#6])-[#6]-1=O
: