Target
Tyrosine-protein kinase BTK
Ligand
BDBM350881
Substrate
Meas. Tech.
Kinase Inhibition Assay
Ki
<100±n/a nM
Citation
 Laurent, ARose, Y Protein kinase inhibitors US Patent  US9795608 Publication Date 10/24/2017 
Target
Name:
Tyrosine-protein kinase BTK
Synonyms:
AGMX1 Agammaglobulinaemia tyrosine kinase B cell progenitor kinase BPK BTK_HUMAN Tyrosine Kinase BTK Tyrosine-protein kinase BTK (BTK)
Type:
Enzyme
Mol. Mass.:
76289.95
Organism:
Homo sapiens (Human)
Description:
Q06187
Residue:
659
  
Inhibitor
Name:
BDBM350881
Synonyms:
US9795608, Compound 11
Type:
Small organic molecule
Emp. Form.:
C27H25FN6O2
Mol. Mass.:
484.5248
SMILES:
CC(C)c1nn(-c2ccc(Oc3cc(F)cc(OCc4ccc(C)nc4)c3)cc2)c2c(N)ncnc12
: