Target
Tyrosine-protein kinase BTK
Ligand
BDBM350882
Substrate
Meas. Tech.
Kinase Inhibition Assay
Ki
<100±n/a nM
Citation
 Laurent, ARose, Y Protein kinase inhibitors US Patent  US9795608 Publication Date 10/24/2017 
Target
Name:
Tyrosine-protein kinase BTK
Synonyms:
AGMX1 Agammaglobulinaemia tyrosine kinase B cell progenitor kinase BPK BTK_HUMAN Tyrosine Kinase BTK Tyrosine-protein kinase BTK (BTK)
Type:
Enzyme
Mol. Mass.:
76289.95
Organism:
Homo sapiens (Human)
Description:
Q06187
Residue:
659
  
Inhibitor
Name:
BDBM350882
Synonyms:
US9795608, Compound 12
Type:
Small organic molecule
Emp. Form.:
C27H24FN5O2
Mol. Mass.:
469.5102
SMILES:
CC(C)c1nn(-c2ccc(Oc3cc(F)cc(OCc4ccccc4)c3)cc2)c2c(N)ncnc12
: