Target
High affinity nerve growth factor receptor
Ligand
BDBM200586
Substrate
Meas. Tech.
ELISA Assay
IC50
9.40±n/a nM
Citation
 Andrews, SWHaas, JJiang, YZhang, G Method of treatment using substituted imidazo[1,2b]pyridazine compounds US Patent  US9795611 Publication Date 10/24/2017 
Target
Name:
High affinity nerve growth factor receptor
Synonyms:
2.7.10.1 NTRK1 NTRK1_HUMAN Neurotrophic tyrosine kinase receptor type 1 Synonyms=MTC TRK1-transforming tyrosine kinase protein TRKA GN Tropomyosin alpha-3 chain/High affinity nerve growth factor receptor Tropomyosin-related kinase A (TrkA) Tyrosine kinase receptor (Trk) Tyrosine kinase receptor A (Trk A) Tyrosine kinase receptor A (TrkA) p140-TrkA
Type:
Mol. Mass.:
87498.18
Organism:
Homo sapiens (Human)
Description:
P04629
Residue:
796
  
Inhibitor
Name:
BDBM200586
Synonyms:
US10011604, 13 US9227975, 13 | US9795611, 13
Type:
Small organic molecule
Emp. Form.:
C20H20F2N6O2
Mol. Mass.:
414.4086
SMILES:
OC1CN(C1)C(=O)Nc1cnc2ccc(nn12)N1CCC[C@@H]1c1cc(F)ccc1F
: