Target
Sigma intracellular receptor 2
Ligand
BDBM349539
Substrate
Meas. Tech.
Radioligand Binding Assay
Ki
310±n/a nM
Citation
 Rishton, GCatalano, SMLook, GC Isoindoline compositions and methods for treating neurodegenerative disease US Patent  US9796672 Publication Date 10/24/2017 
Target
Name:
Sigma intracellular receptor 2
Synonyms:
MAC30 S2R Sigma-2 receptor TMEM97 | Transmembrane protein 97
Type:
Protein
Mol. Mass.:
20857.20
Organism:
Homo sapiens (Human)
Description:
Q5BJF2
Residue:
176
  
Inhibitor
Name:
BDBM349539
Synonyms:
US10207991, Ex. Cpd. No. 55 US11691947, Example 55
Type:
Small organic molecule
Emp. Form.:
C20H20F5NO2
Mol. Mass.:
401.3703
SMILES:
CC(C)(CCc1ccc(O)c(OC(F)(F)F)c1)N1Cc2c(C1)c(F)ccc2F
: