Target
Sigma intracellular receptor 2
Ligand
BDBM349578
Substrate
Meas. Tech.
Radioligand Binding Assay
Ki
1.40±n/a nM
Citation
 Rishton, GCatalano, SMLook, GC Isoindoline compositions and methods for treating neurodegenerative disease US Patent  US9796672 Publication Date 10/24/2017 
Target
Name:
Sigma intracellular receptor 2
Synonyms:
MAC30 S2R Sigma-2 receptor TMEM97 | Transmembrane protein 97
Type:
Protein
Mol. Mass.:
20857.20
Organism:
Homo sapiens (Human)
Description:
Q5BJF2
Residue:
176
  
Inhibitor
Name:
BDBM349578
Synonyms:
US10207991, Ex. Cpd. No. 103 US11691947, Example 103
Type:
Small organic molecule
Emp. Form.:
C21H27NO3S
Mol. Mass.:
373.509
SMILES:
COc1cccc(CCC(C)(C)N2Cc3ccc(cc3C2)S(C)(=O)=O)c1
: