Target
Lysosomal acid glucosylceramidase
Ligand
BDBM50182801
Substrate
Meas. Tech.
Inhibition Assay
IC50
8.20±n/a nM
Citation
 Kaul, RMcEachern, EJSun, JVocadlo, DJZhou, YZhu, Y Glucocerebrosidase modulators and uses thereof US Patent  US9796680 Publication Date 10/24/2017 
Target
Name:
Lysosomal acid glucosylceramidase
Synonyms:
Acid beta-glucosidase Beta-glucocerebrosidase D-glucosyl-N-acylsphingosine glucohydrolase GBA1 GC GLUC Glucosylceramidase (GBA) Glucosylceramidase precursor (Beta-glucocerebrosidase) (Acid beta-glucosidase) (D-glucosyl-N-acylsphingosine glucohydrolase) (Alglucerase) (Imiglucerase) beta-glucocerebrosidase (GCase)
Type:
Enzyme
Mol. Mass.:
59724.64
Organism:
Homo sapiens (Human)
Description:
The beta-Glu activity was measured with commercially available beta-glucocerebrosidase (Ceredase) as the enzyme source.
Residue:
536
  
Inhibitor
Name:
BDBM50182801
Synonyms:
(3R,4R,5R)-5-(Hydroxymethyl)piperidine-3,4-diol, 8 5-HYDROXYMETHYL-3,4-DIHYDROXYPIPERIDINE CHEMBL206468 US10081601, Example 1.1 isofagomine
Type:
Small organic molecule
Emp. Form.:
C6H13NO3
Mol. Mass.:
147.1723
SMILES:
OC[C@H]1CNC[C@@H](O)[C@@H]1O
: