Target
RAC-beta serine/threonine-protein kinase
Ligand
BDBM16231
Substrate
AKTide-2T
Meas. Tech.
PKB In Vitro Enzyme Assay
pH
7.2±n/a
Temperature
295.15±n/a K
IC50
10±3 nM
Citation
 Donald, AMcHardy, TRowlands, MGHunter, LJDavies, TGBerdini, VBoyle, RGAherne, GWGarrett, MDCollins, I Rapid Evolution of 6-Phenylpurine Inhibitors of Protein Kinase B through Structure-Based Design. J Med Chem 50:2289-92 (2007)  
Target
Name:
RAC-beta serine/threonine-protein kinase
Synonyms:
AKT2 PKB beta Protein kinase B (Akt 2) Protein kinase B, beta RAC-alpha serine/threonine-protein kinase (AKT2) RAC-beta serine/threonine-protein kinase (AKT2) Serine/threonine-protein kinase AKT2 | Serine/threonine-protein kinase Rac alpha/beta
Type:
Enzyme
Mol. Mass.:
55766.64
Organism:
Homo sapiens (Human)
Description:
Residue:
481
  
Inhibitor
Name:
BDBM16231
Synonyms:
2-(4-chlorophenyl)-N-methyl-2-[4-(9H-purin-6-yl)phenyl]ethanamine [2-(4-chlorophenyl)-2-[4-(9H-purin-6-yl)phenyl]ethyl](methyl)amine
Type:
Small organic molecule
Emp. Form.:
C20H18ClN5
Mol. Mass.:
363.843
SMILES:
CNCC(c1ccc(Cl)cc1)c1ccc(cc1)-c1ncnc2nc[nH]c12
:
Substrate
Name:
AKTide-2T
Synonyms:
AKT/PKB/Rac Protein Kinase Substrate
Type:
Peptide
Mol. Mass.:
1719.90
Organism:
Description:
Residue:
14
ARKRERTYSFGHHA