Target
Aldo-keto reductase family 1 member B1
Ligand
BDBM16247
Substrate
BDBM16241
Meas. Tech.
Enzyme Inhibition Assay
pH
6.2±n/a
Temperature
303.15±n/a K
IC50
100000±n/a nM
Citation
 Steuber, HZentgraf, MLa Motta, CSartini, SHeine, AKlebe, G Evidence for a novel binding site conformer of aldose reductase in ligand-bound state. J Mol Biol 369:186-97 (2007)  
Target
Name:
Aldo-keto reductase family 1 member B1
Synonyms:
AKR1B1 ALDR_HUMAN AR Aldose Reductase (ALR2) Aldose reductase (AR)
Type:
Protein
Mol. Mass.:
35855.50
Organism:
Homo sapiens (Human)
Description:
P15121. 4LAU; 2IKI; 4LB4; 2FZD; 2FZ8; 1US0
Residue:
316
  
Inhibitor
Name:
BDBM16247
Synonyms:
2-(10-amino-3,5,5-trioxo-5-thia-4-azatricyclo[7.4.0.0^{2,6}]trideca-1,6,8,10,12-pentaen-4-yl)acetic acid | naphtho[1,2-d]isothiazole acetic acid deriv. 10
Type:
Small organic molecule
Emp. Form.:
C13H10N2O5S
Mol. Mass.:
306.294
SMILES:
Nc1cccc2c3C(=O)N(CC(O)=O)S(=O)(=O)c3ccc12
:
Substrate
Name:
BDBM16241
Synonyms:
2,3-dihydroxypropanal Glycerinformal | Glycerose
Type:
Small organic molecule
Emp. Form.:
C3H6O3
Mol. Mass.:
90.0779
SMILES:
OCC(O)C=O
: