Target
Beta-secretase 1
Ligand
BDBM16263
Substrate
Fluorogenic Substrate
Meas. Tech.
Enzyme Inhibition Measurements
pH
4.5±n/a
Temperature
310.15±n/a K
Ki
26.6±n/a nM
Citation
 Ghosh, AKDevasamudram, THong, LDeZutter, CXu, XWeerasena, VKoelsch, GBilcer, GTang, J Structure-based design of cycloamide-urethane-derived novel inhibitors of human brain memapsin 2 (beta-secretase). Bioorg Med Chem Lett 15:15-20 (2005)  
Target
Name:
Beta-secretase 1
Synonyms:
ASP2 Aspartyl protease 2 BACE1 Beta-secretase (BACE) Beta-secretase 1 (BACE 1) Beta-secretase 1 (BACE1) Beta-site amyloid precursor protein cleaving enzyme 1 Memapsin-2 beta-Secretase (BACE-1) | beta-Secretase (BACE1)
Type:
Protein
Mol. Mass.:
55755.10
Organism:
Homo sapiens (Human)
Description:
P56817
Residue:
501
  
Inhibitor
Name:
BDBM16263
Synonyms:
amide-urethane derived inhibitor 12a | prop-2-en-1-yl N-[(1S)-1-{[(1S)-1-{[(1R,3S,4S)-1-{[(1S)-1-(benzylcarbamoyl)-2-methylpropyl]carbamoyl}-3-hydroxy-1,6-dimethylheptan-4-yl]carbamoyl}-2-(prop-2-en-1-ylcarbamoyl)ethyl]carbamoyl}-2-methylpropyl]carbamate
Type:
Small organic molecule
Emp. Form.:
C38H60N6O8
Mol. Mass.:
728.9184
SMILES:
CC(C)C[C@H](NC(=O)[C@H](CC(=O)NCC=C)NC(=O)[C@@H](NC(=O)OCC=C)C(C)C)[C@@H](O)C[C@@H](C)C(=O)N[C@@H](C(C)C)C(=O)NCc1ccccc1
:
Substrate
Name:
Fluorogenic Substrate
Synonyms:
Type:
Peptide
Mol. Mass.:
4212.11
Organism:
Description:
Residue:
42