Target
Dipeptidyl peptidase 4
Ligand
BDBM16283
Substrate
BDBM11561
Meas. Tech.
DPP Inhibition Assay
pH
7.4±n/a
Temperature
295.15±n/a K
IC50
30±5 nM
Citation
 Feng, JZhang, ZWallace, MBStafford, JAKaldor, SWKassel, DBNavre, MShi, LSkene, RJAsakawa, TTakeuchi, KXu, RWebb, DRGwaltney, SL Discovery of alogliptin: a potent, selective, bioavailable, and efficacious inhibitor of dipeptidyl peptidase IV. J Med Chem 50:2297-300 (2007)  
Target
Name:
Dipeptidyl peptidase 4
Synonyms:
ADABP Adenosine deaminase complexing protein 2 CD_antigen=CD26 DPP4 DPPIV Dipeptidyl peptidase 4 (DPP IV) Dipeptidyl peptidase 4 (DPP4) Dipeptidyl peptidase 4 membrane form Dipeptidyl peptidase IV Dipeptidyl peptidase IV (DDP-IV) Dipeptidyl peptidase IV membrane form Dipeptidyl peptidase-IV (DPP-4) T-cell activation antigen CD26 | TP103
Type:
Enzyme
Mol. Mass.:
88271.01
Organism:
Homo sapiens (Human)
Description:
P27487
Residue:
766
  
Inhibitor
Name:
BDBM16283
Synonyms:
2-({2-[(3R)-3-aminopiperidin-1-yl]-8-methoxy-4-oxo-3,4-dihydroquinazolin-3-yl}methyl)benzonitrile quinazolinone-based inhibitor 1l
Type:
Small organic molecule
Emp. Form.:
C22H23N5O2
Mol. Mass.:
389.4503
SMILES:
COc1cccc2c1nc(N1CCC[C@@H](N)C1)n(Cc1ccccc1C#N)c2=O
:
Substrate
Name:
BDBM11561
Synonyms:
1-(2-aminopropanoyl)-N-[2-oxo-4-(trifluoromethyl)-2H-chromen-7-yl]pyrrolidine-2-carboxamide | Ala-Pro-7-amido-4-trifluoromethylcoumarin
Type:
Small organic molecule
Emp. Form.:
C18H18F3N3O4
Mol. Mass.:
397.3484
SMILES:
CC(N)C(=O)N1CCCC1C(=O)Nc1ccc2c(cc(=O)oc2c1)C(F)(F)F
: