Target
Enoyl-[acyl-carrier-protein] reductase [NADH]
Ligand
BDBM16297
Substrate
BDBM16293
Meas. Tech.
Measurement of Inhibition Constants
pH
6.8±n/a
Temperature
295.15±n/a K
Ki
9.4±0.5 nM
Km
29000±n/a nM
Citation
 Sullivan, TJTruglio, JJBoyne, MENovichenok, PZhang, XStratton, CFLi, HJKaur, TAmin, AJohnson, FSlayden, RAKisker, CTonge, PJ High affinity InhA inhibitors with activity against drug-resistant strains of Mycobacterium tuberculosis. ACS Chem Biol 1:43-53 (2006)  
Target
Name:
Enoyl-[acyl-carrier-protein] reductase [NADH]
Synonyms:
Enoyl-ACP Reductase (InhA) Enoyl-[acyl-carrier-protein] reductase [NADH] NADH-dependent enoyl-ACP reductase | inhA
Type:
Enzyme
Mol. Mass.:
28526.00
Organism:
Mycobacterium tuberculosis (strain ATCC 25618 / H37Rv)
Description:
P9WGR1
Residue:
269
  
Inhibitor
Name:
BDBM16297
Synonyms:
5-Hexyl-2-phenoxy-phenol 5-hexyl-2-phenoxyphenol AIDS227446 | PT04
Type:
Small organic molecule
Emp. Form.:
C18H22O2
Mol. Mass.:
270.3661
SMILES:
CCCCCCc1ccc(Oc2ccccc2)c(O)c1
:
Substrate
Name:
BDBM16293
Synonyms:
(2E)-Dodecenoyl-CoA trans-2-Dodecenoyl-Coenzyme A
Type:
Emp. Form.:
C33H56N7O17P3S
Mol. Mass.:
947.821
SMILES:
CCCCCCCCC\C=C\C(=O)SCCNC(=O)CCNC(=O)C(O)C(C)(C)COP(O)(=O)OP(O)(=O)OC[C@H]1O[C@H]([C@H](O)[C@@H]1OP(O)(O)=O)n1cnc2c(N)ncnc12
: