Target
Serine protease 1
Ligand
BDBM16305
Substrate
BDBM12679
Meas. Tech.
Enzyme Inhibition Assay
pH
8.2±n/a
Temperature
295.15±n/a K
Ki
666±n/a nM
Citation
 Katz, BAClark, JMFiner-Moore, JSJenkins, TEJohnson, CRRoss, MJLuong, CMoore, WRStroud, RM Design of potent selective zinc-mediated serine protease inhibitors. Nature 391:608-12 (1998)  
Target
Name:
Serine protease 1
Synonyms:
Alpha-trypsin chain 1 Beta-trypsin PRSS1 TRP1 TRY1_HUMAN Thrombin & trypsin Trypsin I | Trypsin-1
Type:
Enzyme
Mol. Mass.:
26557.80
Organism:
Homo sapiens (Human)
Description:
P07477
Residue:
247
  
Inhibitor
Name:
BDBM16305
Synonyms:
2-(1H-imidazol-2-ylmethyl)-1H-1,3-benzodiazole-6-carboximidamide APD-3
Type:
Small organic molecule
Emp. Form.:
C12H12N6
Mol. Mass.:
240.2639
SMILES:
NC(=N)c1ccc2nc(Cc3ncc[nH]3)[nH]c2c1
:
Substrate
Name:
BDBM12679
Synonyms:
BDBM13790 Chromogenic Substrate
Type:
Small organic molecule
Emp. Form.:
C26H34N6O7S
Mol. Mass.:
574.649
SMILES:
Cc1ccc(cc1)S(=O)(=O)NCC(=O)N1CCCC1C(=O)NC(CCCCN)C(=O)Nc1ccc(cc1)[N+]([O-])=O
: