Target
Prothrombin
Ligand
BDBM16127
Substrate
BDBM12679
Meas. Tech.
Enzyme Inhibition Assay
Ki
3700±n/a nM
Citation
 Katz, BAClark, JMFiner-Moore, JSJenkins, TEJohnson, CRRoss, MJLuong, CMoore, WRStroud, RM Design of potent selective zinc-mediated serine protease inhibitors. Nature 391:608-12 (1998)  
Target
Name:
Prothrombin
Synonyms:
Activation peptide fragment 1 Coagulation factor II Prothrombin precursor Thrombin heavy chain | Thrombin light chain
Type:
Protein
Mol. Mass.:
70029.57
Organism:
Homo sapiens (Human)
Description:
P00734
Residue:
622
  
Inhibitor
Name:
BDBM16127
Synonyms:
2,2 -methanediylbis(1H-benzimidazole-6-carboximidamide) AIDS007118 CHEMBL542712 | CHEMBL99951
Type:
Small organic molecule
Emp. Form.:
C17H16N8
Mol. Mass.:
332.3625
SMILES:
NC(=N)c1ccc2nc(Cc3nc4ccc(cc4[nH]3)C(N)=N)[nH]c2c1
:
Substrate
Name:
BDBM12679
Synonyms:
BDBM13790 Chromogenic Substrate
Type:
Small organic molecule
Emp. Form.:
C26H34N6O7S
Mol. Mass.:
574.649
SMILES:
Cc1ccc(cc1)S(=O)(=O)NCC(=O)N1CCCC1C(=O)NC(CCCCN)C(=O)Nc1ccc(cc1)[N+]([O-])=O
: