Target
Serine protease 1
Ligand
BDBM16309
Substrate
BDBM12679
Meas. Tech.
Enzyme Inhibition Assay
Ki
41800±n/a nM
Citation
 Katz, BAClark, JMFiner-Moore, JSJenkins, TEJohnson, CRRoss, MJLuong, CMoore, WRStroud, RM Design of potent selective zinc-mediated serine protease inhibitors. Nature 391:608-12 (1998)  
Target
Name:
Serine protease 1
Synonyms:
Alpha-trypsin chain 1 Beta-trypsin PRSS1 TRP1 TRY1_HUMAN Thrombin & trypsin Trypsin I | Trypsin-1
Type:
Enzyme
Mol. Mass.:
26557.80
Organism:
Homo sapiens (Human)
Description:
P07477
Residue:
247
  
Inhibitor
Name:
BDBM16309
Synonyms:
2-(quinolin-8-yl)-1H-1,3-benzodiazole-6-carboximidamide APD-7
Type:
Small organic molecule
Emp. Form.:
C17H13N5
Mol. Mass.:
287.3186
SMILES:
NC(=N)c1ccc2nc([nH]c2c1)-c1cccc2cccnc12
:
Substrate
Name:
BDBM12679
Synonyms:
BDBM13790 Chromogenic Substrate
Type:
Small organic molecule
Emp. Form.:
C26H34N6O7S
Mol. Mass.:
574.649
SMILES:
Cc1ccc(cc1)S(=O)(=O)NCC(=O)N1CCCC1C(=O)NC(CCCCN)C(=O)Nc1ccc(cc1)[N+]([O-])=O
: