Target
Mitogen-activated protein kinase 3
Ligand
BDBM351110
Substrate
Meas. Tech.
Omnia Assay
IC50
<100±n/a nM
Citation
 Haq, NNiu, DPetter, RCQiao, LSingh, JZhu, Z ERK inhibitors and uses thereof US Patent  US9796700 Publication Date 10/24/2017 
Target
Name:
Mitogen-activated protein kinase 3
Synonyms:
ERK1 Extracellular signal-regulated kinase 1 MAP kinase ERK1 MAPK3/MAPK7 Mitogen-activated protein kinase PRKM3
Type:
Protein
Mol. Mass.:
43136.58
Organism:
Homo sapiens (Human)
Description:
curated by PDB 4QTB
Residue:
379
  
Inhibitor
Name:
BDBM351110
Synonyms:
US9796700, Compound I-205
Type:
Small organic molecule
Emp. Form.:
C20H19ClN6O3S
Mol. Mass.:
458.921
SMILES:
Cc1ccc(cc1Nc1ncc(Cl)c(Nc2ccccc2NC(=O)C=C)n1)S(N)(=O)=O
: