Target
Cytochrome P450 11B2, mitochondrial
Ligand
BDBM351260
Substrate
Meas. Tech.
Inhibition Assay
EC50
0.012±n/a nM
Citation
 Aebi, JAmrein, KHornsperger, BKuhn, BLiu, YMaerki, HPMartin, REMayweg, AVTan, XWang, LLi, DWu, J Dihydroquinoline pyrazolyl compounds US Patent  US9796702 Publication Date 10/24/2017 
Target
Name:
Cytochrome P450 11B2, mitochondrial
Synonyms:
Aldosterone Synthase (CYP11B2) Aldosterone-synthesizing enzyme CYP11B2 Cytochrome P450 11B2 Cytochrome P450 11B2, mitochondrial P-450C18 | Steroid 18-hydroxylase
Type:
Protein
Mol. Mass.:
57582.15
Organism:
Homo sapiens (Human)
Description:
P19099
Residue:
503
  
Inhibitor
Name:
BDBM351260
Synonyms:
6-[4-[(1-Acetyl-4-piperidyl)methyl]-1H-pyrazol-3-yl]-5-fluoro-1-methyl-3,4-dihydroquinolin-2-one US9796702, 25
Type:
Small organic molecule
Emp. Form.:
C21H25FN4O2
Mol. Mass.:
384.4472
SMILES:
CN1C(=O)CCc2c(F)c(ccc12)-c1n[nH]cc1CC1CCN(CC1)C(C)=O
: