Target
Cytochrome P450 11B1, mitochondrial
Ligand
BDBM351273
Substrate
Meas. Tech.
Inhibition Assay
EC50
0.547±n/a nM
Citation
 Aebi, JAmrein, KHornsperger, BKuhn, BLiu, YMaerki, HPMartin, REMayweg, AVTan, XWang, LLi, DWu, J Dihydroquinoline pyrazolyl compounds US Patent  US9796702 Publication Date 10/24/2017 
Target
Name:
Cytochrome P450 11B1, mitochondrial
Synonyms:
C11B1_HUMAN CYPXIB1 Cytochrome P450 11B1 Cytochrome P450 11B1, mitochondrial | S11BH
Type:
Enzyme
Mol. Mass.:
57591.44
Organism:
Homo sapiens (Human)
Description:
P15538
Residue:
503
  
Inhibitor
Name:
BDBM351273
Synonyms:
CHEM-US-00084 | US9796702, 34
Type:
Small organic molecule
Emp. Form.:
C25H26ClN5O2
Mol. Mass.:
463.959
SMILES:
CN1C(=O)CCc2cc(ccc12)-c1n[nH]cc1CC1CCN(CC1)C(=O)c1ncccc1Cl
: