Target
Epidermal growth factor receptor
Ligand
BDBM351307
Substrate
Meas. Tech.
AlphaScreen Assay
IC50
<50±n/a nM
Citation
 Rice, KDAnand, NKBussenius, JCostanzo, SKennedy, ARPeto, CJTsang, THBlazey, CM Substituted quinazolines as receptor-type kinase inhibitors US Patent  US9796704 Publication Date 10/24/2017 
Target
Name:
Epidermal growth factor receptor
Synonyms:
EGF Receptor Substrate EGFR_HUMAN ERBB1 Epidermal Growth Factor Receptor erbB-1 Epidermal growth factor receptor (EGFR) HER1 Proto-oncogene c-ErbB-1 Tyrosine-Protein Kinase ErbB-1
Type:
Receptor Kinase Domain
Mol. Mass.:
134279.59
Organism:
Homo sapiens (Human)
Description:
P00533
Residue:
1210
  
Inhibitor
Name:
BDBM351307
Synonyms:
N-(3-chloro-2,4-difluorophenyl)-7-{[(3S,8aS)- hexahydro-1H-pyrrolo[2,1-c][1,4]oxazin-3- ylmethyl]oxy}-6-(methyloxy)quinazolin-4- amine | US9796704, Entry 38
Type:
Small organic molecule
Emp. Form.:
C23H23ClF2N4O3
Mol. Mass.:
476.904
SMILES:
COc1cc2c(Nc3ccc(F)c(Cl)c3F)ncnc2cc1OC[C@@H]1CN2CCC[C@H]2CO1
: