Target
Ephrin type-B receptor 4
Ligand
BDBM351334
Substrate
Meas. Tech.
AlphaScreen Assay
IC50
<50±n/a nM
Citation
 Rice, KDAnand, NKBussenius, JCostanzo, SKennedy, ARPeto, CJTsang, THBlazey, CM Substituted quinazolines as receptor-type kinase inhibitors US Patent  US9796704 Publication Date 10/24/2017 
Target
Name:
Ephrin type-B receptor 4
Synonyms:
EPHB4 Ephrin receptor HTK MYK1 Tyrosine-protein kinase TYRO11 | VHL/Ephrin type-B receptor 4
Type:
Enzyme
Mol. Mass.:
108273.51
Organism:
Homo sapiens (Human)
Description:
P54760
Residue:
987
  
Inhibitor
Name:
BDBM351334
Synonyms:
N-(4-bromo-3-chloro-2-fluorophenyl)-7- ({[(3aR,5r,6aS)-2-(1- methylethyl)octahydrocyclopenta[c]pyrrol-5- yl]methyl}oxy)-6-(methyloxy)quinazolin-4- amine | US9796704, Entry 2
Type:
Small organic molecule
Emp. Form.:
C26H29BrClFN4O2
Mol. Mass.:
563.889
SMILES:
COc1cc2c(Nc3ccc(Br)c(Cl)c3F)ncnc2cc1OC[C@H]1C[C@H]2CN(C[C@H]2C1)C(C)C
: