Target
Vascular endothelial growth factor receptor 2
Ligand
BDBM351323
Substrate
Meas. Tech.
AlphaScreen Assay
IC50
<50±n/a nM
Citation
 Rice, KDAnand, NKBussenius, JCostanzo, SKennedy, ARPeto, CJTsang, THBlazey, CM Substituted quinazolines as receptor-type kinase inhibitors US Patent  US9796704 Publication Date 10/24/2017 
Target
Name:
Vascular endothelial growth factor receptor 2
Synonyms:
CD_antigen=CD309 Fetal liver kinase 1 (FLK-1) KDR Protein-tyrosine kinase receptor Flk-1 VEGFR-2 VEGFR2 Vascular Endothelial Growth Factor Receptor Kinase 2 Vascular endothelial growth factor receptor 2 (KDR) Vascular endothelial growth factor receptor 2 (VEGFR2) Vascular endothelial growth factor receptor-2 (VEGFR-2)
Type:
Receptor Tyrosine Kinase
Mol. Mass.:
151510.97
Organism:
Homo sapiens (Human)
Description:
P35968
Residue:
1356
  
Inhibitor
Name:
BDBM351323
Synonyms:
N-(3,4-dichlorophenyl)-7-{[(8-methyl-8- azabicyclo[3.2.1]oct-3-yl)methyl]oxy}-6- (methyloxy)quinazolin-4-amine | US9796704, Entry 58
Type:
Small organic molecule
Emp. Form.:
C24H26Cl2N4O2
Mol. Mass.:
473.395
SMILES:
COc1cc2c(Nc3ccc(Cl)c(Cl)c3)ncnc2cc1OCC1CC2CCC(C1)N2C
: