Target
Epidermal growth factor receptor
Ligand
BDBM351535
Substrate
Meas. Tech.
AlphaScreen Assay
IC50
<50±n/a nM
Citation
 Rice, KDAnand, NKBussenius, JCostanzo, SKennedy, ARPeto, CJTsang, THBlazey, CM Substituted quinazolines as receptor-type kinase inhibitors US Patent  US9796704 Publication Date 10/24/2017 
Target
Name:
Epidermal growth factor receptor
Synonyms:
EGF Receptor Substrate EGFR_HUMAN ERBB1 Epidermal Growth Factor Receptor erbB-1 Epidermal growth factor receptor (EGFR) HER1 Proto-oncogene c-ErbB-1 Tyrosine-Protein Kinase ErbB-1
Type:
Receptor Kinase Domain
Mol. Mass.:
134279.59
Organism:
Homo sapiens (Human)
Description:
P00533
Residue:
1210
  
Inhibitor
Name:
BDBM351535
Synonyms:
N-(3,4-dichlorophenyl)-7-[({2-[(2S)-1- ethylpyrrolidin-2-yl]-1,3-thiazol-4- yl}methyl)oxy]-6-(methyloxy)quinazolin-4- amine | US9796704, Entry 256
Type:
Small organic molecule
Emp. Form.:
C25H25Cl2N5O2S
Mol. Mass.:
530.469
SMILES:
CCN1CCCC1c1nc(COc2cc3ncnc(Nc4ccc(Cl)c(Cl)c4)c3cc2OC)cs1
: