Target
Mitogen-activated protein kinase 9
Ligand
BDBM351589
Substrate
Meas. Tech.
HTRF Assay
IC50
<100±n/a nM
Citation
 Sham, HLHom, RKKonradi, AWProbst, GDBowers, STruong, ANeitz, RJSealy, JToth, G Inhibitors of Jun N-terminal kinase US Patent  US9796706 Publication Date 10/24/2017 
Target
Name:
Mitogen-activated protein kinase 9
Synonyms:
JNK-55 JNK2/JNK3 MK09_HUMAN Mitogen-activated protein kinase 8/9 SAPK1A c-Jun N-terminal kinase 2 | c-Jun N-terminal kinase 2 (JNK2)
Type:
Enzyme
Mol. Mass.:
48131.49
Organism:
Homo sapiens (Human)
Description:
JNK-2 was purchased from Upstate Cell Signaling Solutions (formerly Upstate Biotechnology).
Residue:
424
  
Inhibitor
Name:
BDBM351589
Synonyms:
N-(4-bromo-3-(1H-1,2,4-triazol-5-yl)thiophen-2-yl)-2-(quinolin-5-yl)acetamide | US9796706, Compound 33
Type:
Small organic molecule
Emp. Form.:
C17H12BrN5OS
Mol. Mass.:
414.279
SMILES:
Brc1csc(NC(=O)Cc2cccc3ncccc23)c1-c1ncn[nH]1
: