Target
Mitogen-activated protein kinase 10
Ligand
BDBM351654
Substrate
Meas. Tech.
HTRF Assay
IC50
<100±n/a nM
Citation
 Sham, HLHom, RKKonradi, AWProbst, GDBowers, STruong, ANeitz, RJSealy, JToth, G Inhibitors of Jun N-terminal kinase US Patent  US9796706 Publication Date 10/24/2017 
Target
Name:
Mitogen-activated protein kinase 10
Synonyms:
JNK3 MAP kinase p49 3F12 MK10_HUMAN Mitogen-activated protein kinase 10 (Stress-activated protein kinase JNK3) (c-Jun N-terminal kinase 3) (MAP kinase p49 3F12) PRKM10 Stress-activated protein kinase JNK3 | c-Jun N-terminal kinase 3 (JNK3)
Type:
Enzyme
Mol. Mass.:
52586.89
Organism:
Homo sapiens (Human)
Description:
Residue:
464
  
Inhibitor
Name:
BDBM351654
Synonyms:
N-(4-bromo-3-(1H-1,2,4-triazol-5-yl)thiophen-2-yl)-2-(2-oxo-3,4-dihydro-1,6-naphthyridin-1(2H)-yl)acetamide | US9796706, Compound 98
Type:
Small organic molecule
Emp. Form.:
C16H13BrN6O2S
Mol. Mass.:
433.282
SMILES:
Brc1csc(NC(=O)CN2C(=O)CCc3cnccc23)c1-c1ncn[nH]1
: