Target
Mitogen-activated protein kinase 10
Ligand
BDBM50352623
Substrate
Meas. Tech.
HTRF Assay
IC50
<100±n/a nM
Citation
 Sham, HLHom, RKKonradi, AWProbst, GDBowers, STruong, ANeitz, RJSealy, JToth, G Inhibitors of Jun N-terminal kinase US Patent  US9796706 Publication Date 10/24/2017 
Target
Name:
Mitogen-activated protein kinase 10
Synonyms:
JNK3 MAP kinase p49 3F12 MK10_HUMAN Mitogen-activated protein kinase 10 (Stress-activated protein kinase JNK3) (c-Jun N-terminal kinase 3) (MAP kinase p49 3F12) PRKM10 Stress-activated protein kinase JNK3 | c-Jun N-terminal kinase 3 (JNK3)
Type:
Enzyme
Mol. Mass.:
52586.89
Organism:
Homo sapiens (Human)
Description:
Residue:
464
  
Inhibitor
Name:
BDBM50352623
Synonyms:
CHEMBL1822154 | US9796706, Compound 150
Type:
Small organic molecule
Emp. Form.:
C17H13BrN4O2S2
Mol. Mass.:
449.345
SMILES:
Brc1csc(NC(=O)CN2C(=O)CCc3ncccc23)c1-c1nccs1
: