Target
SRSF protein kinase 1
Ligand
BDBM101714
Substrate
Meas. Tech.
In Vitro Kinase Assay
IC50
10000±n/a nM
Citation
 Bates, DMorris, J Piperazine derivatives for treating disorders US Patent  US9796707 Publication Date 10/24/2017 
Target
Name:
SRSF protein kinase 1
Synonyms:
SRPK1 SRSF protein kinase 1 (SRPK1) Serine/threonine-protein kinase SRPK1
Type:
Protein
Mol. Mass.:
74318.38
Organism:
Homo sapiens (Human)
Description:
Q96SB4
Residue:
655
  
Inhibitor
Name:
BDBM101714
Synonyms:
US9695160, 26 | US9796707, Compound 26
Type:
Small organic molecule
Emp. Form.:
C26H23F3N6O2
Mol. Mass.:
508.495
SMILES:
FC(F)(F)c1ccc(N2CCN(Cc3ccccn3)CC2)c(NC(=O)c2nnc(o2)-c2ccccc2)c1
: