Target
SRSF protein kinase 1
Ligand
BDBM101831
Substrate
Meas. Tech.
In Vitro Kinase Assay
IC50
8413±n/a nM
Citation
 Bates, DMorris, J Piperazine derivatives for treating disorders US Patent  US9796707 Publication Date 10/24/2017 
Target
Name:
SRSF protein kinase 1
Synonyms:
SRPK1 SRSF protein kinase 1 (SRPK1) Serine/threonine-protein kinase SRPK1
Type:
Protein
Mol. Mass.:
74318.38
Organism:
Homo sapiens (Human)
Description:
Q96SB4
Residue:
655
  
Inhibitor
Name:
BDBM101831
Synonyms:
US9695160, 44 | US9796707, Compound 44
Type:
Small organic molecule
Emp. Form.:
C20H20F3N7O
Mol. Mass.:
431.4143
SMILES:
FC(F)(F)c1ccc(N2CCN(Cc3ccccn3)CC2)c(NC(=O)c2ncn[nH]2)c1
: