Target
High affinity nerve growth factor receptor
Ligand
BDBM136653
Substrate
Meas. Tech.
TrkA ELISA Assay
pH
7.5±n/a
IC50
55.6±n/a nM
Comments
extracted
Citation
 Haas, JAndrews, SWJiang, YZhang, G Method of treatment using substituted pyrazolo[1,5-a] pyrimidine compounds US Patent  US10047097 Publication Date 8/14/2018 
Target
Name:
High affinity nerve growth factor receptor
Synonyms:
2.7.10.1 NTRK1 NTRK1_HUMAN Neurotrophic tyrosine kinase receptor type 1 Synonyms=MTC TRK1-transforming tyrosine kinase protein TRKA GN Tropomyosin alpha-3 chain/High affinity nerve growth factor receptor Tropomyosin-related kinase A (TrkA) Tyrosine kinase receptor (Trk) Tyrosine kinase receptor A (Trk A) Tyrosine kinase receptor A (TrkA) p140-TrkA
Type:
Mol. Mass.:
87498.18
Organism:
Homo sapiens (Human)
Description:
P04629
Residue:
796
  
Inhibitor
Name:
BDBM136653
Synonyms:
US10005783, 70 US10774085, Example 70 US8865698, 70 | US9676783, 70
Type:
Small organic molecule
Emp. Form.:
C23H21FN6O2
Mol. Mass.:
432.4502
SMILES:
Cn1ccc(cc1=O)C(=O)Nc1cnn2ccc(nc12)N1CCC[C@@H]1c1cccc(F)c1
: