Target
Aldo-keto reductase family 1 member B1
Ligand
BDBM16431
Substrate
BDBM16416
Meas. Tech.
Enzyme Inhibition Assay
pH
7±n/a
Temperature
298.15±n/a K
Ki
6200±400 nM
Citation
 Brownlee, JMCarlson, EMilne, ACPape, EHarrison, DH Structural and thermodynamic studies of simple aldose reductase-inhibitor complexes. Bioorg Chem 34:424-44 (2006)  
Target
Name:
Aldo-keto reductase family 1 member B1
Synonyms:
AKR1B1 ALDR_HUMAN AR Aldose Reductase (ALR2) Aldose reductase (AR)
Type:
Protein
Mol. Mass.:
35855.50
Organism:
Homo sapiens (Human)
Description:
P15121. 4LAU; 2IKI; 4LB4; 2FZD; 2FZ8; 1US0
Residue:
316
  
Inhibitor
Name:
BDBM16431
Synonyms:
2-(naphthalen-2-yl)acetic acid Betoxan beta-Naphthylacetic acid | naphthalen-2-ylacetic acid
Type:
Small organic molecule
Emp. Form.:
C12H10O2
Mol. Mass.:
186.2066
SMILES:
OC(=O)Cc1ccc2ccccc2c1
:
Substrate
Name:
BDBM16416
Synonyms:
pentane-1,2,3,4,5-pentol | xylitol
Type:
Small organic molecule
Emp. Form.:
C5H12O5
Mol. Mass.:
152.1458
SMILES:
OCC(O)C(O)C(O)CO
: