Target
Cyclin-T1/Cyclin-dependent kinase 9
Ligand
BDBM167553
Substrate
Meas. Tech.
LANCE ULight TR-FRET Kinase Assay
IC50
10.00±n/a nM
Citation
 Tong, YBruncko, MClark, RFCurtin, MFlorjancic, ASFrey, RRGong, JHansen, TMJi, ZLai, CMastracchio, AMichaelides, MMiyashiro, JRisi, RMSong, XTao, ZWoods, KWZhu, GPenning, TSouers, AGoswami, RIguturi, ORDabbeeru, MB Pyrrolo [2,3-B] pyridine CDK9 kinase inhibitors US Patent  US9796708 Publication Date 10/24/2017 
Target
Name:
Cyclin-T1/Cyclin-dependent kinase 9
Synonyms:
CDK9/ Cyclin-T1 CDK9/Cyclin T Cyclin T1/dependent kinase 9 | Cyclin-Dependent Kinase 9 (CDK9)
Type:
Protein Complex
Mol. Mass.:
Description:
Components:
This complex has 2 components.
Component 1
Name:
Cyclin-T1
Synonyms:
CCNT1 CycT Cyclin T Cyclin-T
Type:
Enzyme Subunit
Mol. Mass.:
80712.40
Organism:
Homo sapiens (Human)
Description:
Residue:
726
  
Component 2
Name:
Cyclin-dependent kinase 9
Synonyms:
C-2K CDK9 Cell division cycle 2-like protein kinase 4 Cyclin-Dependent Kinase 9 (CDK9) Serine/threonine-protein kinase PITALRE Tat-associated kinase complex catalytic subunit
Type:
Enzyme Subunit
Mol. Mass.:
42789.13
Organism:
Homo sapiens (Human)
Description:
Residue:
372
  
Inhibitor
Name:
BDBM167553
Synonyms:
US9073922, 37 | US9796708, Example 37
Type:
Small organic molecule
Emp. Form.:
C23H22ClFN6
Mol. Mass.:
436.912
SMILES:
Fc1cncc(CNc2ccc(Cl)c(n2)-c2ccnc3[nH]c(cc23)C2CCNCC2)c1
: