Target
Nuclear receptor ROR-gamma
Ligand
BDBM351695
Substrate
Meas. Tech.
Binding Assay
Ki
<100±n/a nM
Citation
 Claremon, DADillard, LWDong, CFan, YJia, LLotesta, SDMarcus, ASingh, SBTice, CMYuan, JZhao, WZheng, YZhuang, L Dihydropyrrolopyridine inhibitors of ROR-gamma US Patent  US9796710 Publication Date 10/24/2017 
Target
Name:
Nuclear receptor ROR-gamma
Synonyms:
NR1F3 Nuclear receptor ROR-gamma (RORC) RAR-related orphan receptor C (RORc) RORG RZRG Retinoid-related orphan receptor-gamma (RORc)
Type:
Enzyme Catalytic Domain
Mol. Mass.:
58218.40
Organism:
Homo sapiens (Human)
Description:
P51449
Residue:
518
  
Inhibitor
Name:
BDBM351695
Synonyms:
US9796710, Compound 25
Type:
Small organic molecule
Emp. Form.:
C27H34F3N3O5S
Mol. Mass.:
569.636
SMILES:
CC(C)[C@@H]1N(C[C@H]2CC[C@@H](CO2)C(F)(F)F)Cc2cc(cnc12)C(=O)N[C@@H](CO)c1ccc(cc1)S(C)(=O)=O
: