Target
Nuclear receptor ROR-gamma
Ligand
BDBM351750
Substrate
Meas. Tech.
Binding Assay
Ki
<100±n/a nM
Citation
 Claremon, DADillard, LWDong, CFan, YJia, LLotesta, SDMarcus, ASingh, SBTice, CMYuan, JZhao, WZheng, YZhuang, L Dihydropyrrolopyridine inhibitors of ROR-gamma US Patent  US9796710 Publication Date 10/24/2017 
Target
Name:
Nuclear receptor ROR-gamma
Synonyms:
NR1F3 Nuclear receptor ROR-gamma (RORC) RAR-related orphan receptor C (RORc) RORG RZRG Retinoid-related orphan receptor-gamma (RORc)
Type:
Enzyme Catalytic Domain
Mol. Mass.:
58218.40
Organism:
Homo sapiens (Human)
Description:
P51449
Residue:
518
  
Inhibitor
Name:
BDBM351750
Synonyms:
US9796710, Compound 43
Type:
Small organic molecule
Emp. Form.:
C30H43N3O5S
Mol. Mass.:
557.745
SMILES:
CCO[C@H]1CC[C@H](CN2Cc3cc(cnc3[C@@H]2C(C)C)C(=O)N[C@@H](CO)c2ccc(cc2)S(=O)(=O)CC)CC1
: