Target
Tyrosine-protein kinase BTK
Ligand
BDBM351790
Substrate
Meas. Tech.
Fluorescence Polarization-Based Kinase Assay
Ki
<100±n/a nM
Citation
 Laurent, ARose, YJaquith, JB Selective inhibitors of Tec and Src protein kinase families US Patent  US9796716 Publication Date 10/24/2017 
Target
Name:
Tyrosine-protein kinase BTK
Synonyms:
AGMX1 Agammaglobulinaemia tyrosine kinase B cell progenitor kinase BPK BTK_HUMAN Tyrosine Kinase BTK Tyrosine-protein kinase BTK (BTK)
Type:
Enzyme
Mol. Mass.:
76289.95
Organism:
Homo sapiens (Human)
Description:
Q06187
Residue:
659
  
Inhibitor
Name:
BDBM351790
Synonyms:
US9796716, Compound 34
Type:
Small organic molecule
Emp. Form.:
C25H25N7O2S
Mol. Mass.:
487.577
SMILES:
CN(C)CCn1nc(-c2ccc(Oc3cccc(OCc4cncs4)c3)cc2)c2c(N)ncnc12
: