Target
Tyrosine-protein kinase BTK
Ligand
BDBM351805
Substrate
Meas. Tech.
Fluorescence Polarization-Based Kinase Assay
Ki
<100±n/a nM
Citation
 Laurent, ARose, YJaquith, JB Selective inhibitors of Tec and Src protein kinase families US Patent  US9796716 Publication Date 10/24/2017 
Target
Name:
Tyrosine-protein kinase BTK
Synonyms:
AGMX1 Agammaglobulinaemia tyrosine kinase B cell progenitor kinase BPK BTK_HUMAN Tyrosine Kinase BTK Tyrosine-protein kinase BTK (BTK)
Type:
Enzyme
Mol. Mass.:
76289.95
Organism:
Homo sapiens (Human)
Description:
Q06187
Residue:
659
  
Inhibitor
Name:
BDBM351805
Synonyms:
US9796716, Compound 49
Type:
Small organic molecule
Emp. Form.:
C31H33N7O4S
Mol. Mass.:
599.703
SMILES:
CC(C)(C)OC(=O)N1CCCC(C1)n1nc(-c2ccc(Oc3cccc(OCc4cncs4)c3)cc2)c2c(N)ncnc12
: