Target
Glucocorticoid receptor
Ligand
BDBM351896
Substrate
Meas. Tech.
Binding Assay
Ki
0.820±n/a nM
Citation
 Yang, MGXiao, ZWeinstein, DS Imidazole-derived modulators of the glucocorticoid receptor US Patent  US9796720 Publication Date 10/24/2017 
Target
Name:
Glucocorticoid receptor
Synonyms:
GCR_HUMAN GRL Glucocorticoid receptor (GRFP) Nuclear receptor subfamily 3 group C member 1
Type:
Enzyme
Mol. Mass.:
85656.87
Organism:
Homo sapiens (Human)
Description:
P04150
Residue:
777
  
Inhibitor
Name:
BDBM351896
Synonyms:
(S)-5-(2-(1H-Imidazo[4,5-b]pyrazin-2-yl)propan-2-yl)-2-(4-tert-butoxyphenyl)-9-fluoro-5H-chromeno[2,3-b]pyridine | US9796720, 11
Type:
Small organic molecule
Emp. Form.:
C30H28FN5O2
Mol. Mass.:
509.574
SMILES:
CC(C)(C)Oc1ccc(cc1)-c1ccc2[C@H](c3cccc(F)c3Oc2n1)C(C)(C)c1nc2nccnc2[nH]1
: