Target
Glucocorticoid receptor
Ligand
BDBM351904
Substrate
Meas. Tech.
Binding Assay
Ki
70.5±n/a nM
Citation
 Yang, MGXiao, ZWeinstein, DS Imidazole-derived modulators of the glucocorticoid receptor US Patent  US9796720 Publication Date 10/24/2017 
Target
Name:
Glucocorticoid receptor
Synonyms:
GCR_HUMAN GRL Glucocorticoid receptor (GRFP) Nuclear receptor subfamily 3 group C member 1
Type:
Enzyme
Mol. Mass.:
85656.87
Organism:
Homo sapiens (Human)
Description:
P04150
Residue:
777
  
Inhibitor
Name:
BDBM351904
Synonyms:
(S)-N-(4-(5-(2-(1H-Imidazo[4,5-b]pyrazin-2-yl)propan-2-yl)-9-fluoro-5H-chromeno[2,3-b]pyridin-2-yl)phenyl)acetamide | US9796720, 19
Type:
Small organic molecule
Emp. Form.:
C28H23FN6O2
Mol. Mass.:
494.5196
SMILES:
CC(=O)Nc1ccc(cc1)-c1ccc2[C@H](c3cccc(F)c3Oc2n1)C(C)(C)c1nc2nccnc2[nH]1
: