Target
Cathepsin B
Ligand
BDBM16500
Substrate
BDBM16498
Meas. Tech.
Inhibitory Activity Measurement of Bovine Cathepsin B.
pH
6±n/a
Temperature
313.15±n/a K
IC50
24±n/a nM
Comments
The second order rate constant, k2 =153000 M-1s-1.
Citation
 Watanabe, DYamamoto, ATomoo, KMatsumoto, KMurata, MKitamura, KIshida, T Quantitative evaluation of each catalytic subsite of cathepsin B for inhibitory activity based on inhibitory activity-binding mode relationship of epoxysuccinyl inhibitors by X-ray crystal structure analyses of complexes. J Mol Biol 362:979-93 (2006)  
Target
Name:
Cathepsin B
Synonyms:
BCSB CTSB Cathepsin B1
Type:
Enzyme
Mol. Mass.:
36657.87
Organism:
Bos taurus (bovine)
Description:
Bovine spleen CB was purchased from Sigma Co. (USA).
Residue:
335
  
Inhibitor
Name:
BDBM16500
Synonyms:
(2S)-2-[(2S,3S)-2-{[(2S,3S)-3-(ethoxycarbonyl)oxiran-2-yl]formamido}-3-methylpentanamido]-3-methylpentanoic acid CA076 N-{[(2S,3S)-3-(ethoxycarbonyl)oxiran-2-yl]carbonyl}-L-isoleucyl-L-isoleucine | epoxysuccinyl derivative 3
Type:
Small organic molecule
Emp. Form.:
C18H30N2O7
Mol. Mass.:
386.44
SMILES:
[H][C@@]1(O[C@]1([H])C(=O)OCC)C(=O)N[C@@H]([C@@H](C)CC)C(=O)N[C@@H](C(C)CC)C(O)=O
:
Substrate
Name:
BDBM16498
Synonyms:
Benzyloxycarbonyl (Z)-Phe-Arg 7-(4-methyl)coumarylamide (-NMec) Z-Phe-Arg-NMec | benzyl N-[(1S)-1-{[(1S)-4-carbamimidamido-1-[(4-methyl-2-oxo-2H-chromen-7-yl)carbamoyl]butyl]carbamoyl}-2-phenylethyl]carbamate
Type:
substrate
Emp. Form.:
C33H36N6O6
Mol. Mass.:
612.6755
SMILES:
[#6]-c1cc(=O)oc2cc(-[#7]-[#6](=O)-[#6@H](-[#6]-[#6]-[#6]\[#7]=[#6](\[#7])-[#7])-[#7]-[#6](=O)-[#6@H](-[#6]-c3ccccc3)-[#7]-[#6](=O)-[#8]-[#6]-c3ccccc3)ccc12
: