Target
Mitogen-activated protein kinase 11
Ligand
BDBM16526
Substrate
biotinylated GST-ATF2
Meas. Tech.
Enzyme Inhibition Scintillation Proximity Assay
IC50
41±n/a nM
Citation
 Natarajan, SRHeller, STNam, KSingh, SBScapin, GPatel, SThompson, JEFitzgerald, CEO'Keefe, SJ p38 MAP kinase inhibitors. Part 6: 2-arylpyridazin-3-ones as templates for inhibitor design. Bioorg Med Chem Lett 16:5809-13 (2006)  
Target
Name:
Mitogen-activated protein kinase 11
Synonyms:
MAP Kinase p38 beta Mapk11 Mitogen-activated protein kinase p38 beta p38B
Type:
Enzyme
Mol. Mass.:
41390.66
Organism:
Mus musculus (mouse)
Description:
Q9WUI1
Residue:
364
  
Inhibitor
Name:
BDBM16526
Synonyms:
2-amino-N-{3-[(2-chlorophenyl)[1-(2-chlorophenyl)-6-oxo-1,6-dihydropyridazin-3-yl]amino]propyl}acetamide | 2-arylpyridazin-3-one, 32
Type:
Small organic molecule
Emp. Form.:
C21H21Cl2N5O2
Mol. Mass.:
446.33
SMILES:
NCC(=O)NCCCN(c1ccc(=O)n(n1)-c1ccccc1Cl)c1ccccc1Cl
:
Substrate
Name:
biotinylated GST-ATF2
Synonyms:
ATF-2-GST Activating transcription factor 2 GST-ATF2 biotinylated activating transcription factor 2
Type:
Other Protein Type
Mol. Mass.:
12237.77
Organism:
Homo sapiens (Human)
Description:
Residue:
109