Target
Beta-secretase 2
Ligand
BDBM228006
Substrate
Meas. Tech.
BACE-2 Assay
pH
5±n/a
Ki
13.5±n/a nM
Comments
extracted
Citation
 Dai, XCumming, JNLiu, HScott, JD C5-C6-oxacyclic fused iminopyrimidinone compounds as bace inhibitors, compositions, and their use US Patent  US10047098 Publication Date 8/14/2018 
Target
Name:
Beta-secretase 2
Synonyms:
AEPLC ASP1 Asp 1 Aspartyl protease 1 BACE2_HUMAN Beta-secretase (BACE) Beta-secretase 2 (BACE-2) Beta-site APP-cleaving enzyme 2 Memapsin-1 beta-Secretase (BACE-2)
Type:
Protein
Mol. Mass.:
56171.20
Organism:
Homo sapiens (Human)
Description:
Q9Y5Z0
Residue:
518
  
Inhibitor
Name:
BDBM228006
Synonyms:
US10047098, 34
Type:
Small organic molecule
Emp. Form.:
C25H25FN6O3
Mol. Mass.:
476.5028
SMILES:
CN1C(=N)N[C@]2(CO[C@H](C[C@H]2C1=O)C1CC1)c1cc(Oc2cccc(n2)-n2cccn2)ccc1F
: