Target
Beta-secretase 1
Ligand
BDBM228021
Substrate
Meas. Tech.
BACE1 HTRF FRET Assay
pH
5±n/a
Ki
5722±n/a nM
Comments
extracted
Citation
 Dai, XCumming, JNLiu, HScott, JD C5-C6-oxacyclic fused iminopyrimidinone compounds as bace inhibitors, compositions, and their use US Patent  US10047098 Publication Date 8/14/2018 
Target
Name:
Beta-secretase 1
Synonyms:
ASP2 Aspartyl protease 2 BACE1 Beta-secretase (BACE) Beta-secretase 1 (BACE 1) Beta-secretase 1 (BACE1) Beta-site amyloid precursor protein cleaving enzyme 1 Memapsin-2 beta-Secretase (BACE-1) | beta-Secretase (BACE1)
Type:
Protein
Mol. Mass.:
55755.10
Organism:
Homo sapiens (Human)
Description:
P56817
Residue:
501
  
Inhibitor
Name:
BDBM228021
Synonyms:
US10047098, 47
Type:
Small organic molecule
Emp. Form.:
C16H19F2N3O3
Mol. Mass.:
339.3372
SMILES:
COC[C@@H]1C[C@H]2C(=O)N(C)C(=N)N[C@]2(CO1)c1ccc(F)cc1F
: