Target
High affinity nerve growth factor receptor
Ligand
BDBM354186
Substrate
Meas. Tech.
Omnia Assay
IC50
1.10±n/a nM
Citation
 Allen, SAndrews, SWCondroski, KRHaas, JHuang, LJiang, YKercher, TSeo, J Substituted pyrazolo[1,5-a]pyrimidine compounds as Trk kinase inhibitors US Patent  US9796724 Publication Date 10/24/2017 
Target
Name:
High affinity nerve growth factor receptor
Synonyms:
2.7.10.1 NTRK1 NTRK1_HUMAN Neurotrophic tyrosine kinase receptor type 1 Synonyms=MTC TRK1-transforming tyrosine kinase protein TRKA GN Tropomyosin alpha-3 chain/High affinity nerve growth factor receptor Tropomyosin-related kinase A (TrkA) Tyrosine kinase receptor (Trk) Tyrosine kinase receptor A (Trk A) Tyrosine kinase receptor A (TrkA) p140-TrkA
Type:
Mol. Mass.:
87498.18
Organism:
Homo sapiens (Human)
Description:
P04629
Residue:
796
  
Inhibitor
Name:
BDBM354186
Synonyms:
(R)-5-(2-(5-fluoro-2- methoxypyridin-3-yl)pyrrolidin-1- yl)-N-(3- hydroxypropyl)pyrazolo[l,5- a]pyrimidine-3-carboxamide | US9796724, Example 148
Type:
Small organic molecule
Emp. Form.:
C20H23FN6O3
Mol. Mass.:
414.4334
SMILES:
COc1ncc(F)cc1C1CCCN1c1ccn2ncc(C(=O)NCCCO)c2n1
: