Target
SUMO-activating enzyme subunit 2
Ligand
BDBM329793
Substrate
Meas. Tech.
HTRF Assay
IC50
55±n/a nM
Citation
 Afroze, RBharathan, ITCiavarri, JPFleming, PEGaulin, JLGirard, MLangston, SPSoucy, FWong, TYe, Y Pyrazolopyrimidinyl inhibitors of ubiquitin-activating enzyme US Patent  US9796725 Publication Date 10/24/2017 
Target
Name:
SUMO-activating enzyme subunit 2
Synonyms:
6.3.2.- SAE2 SUMO-activating enzyme subunit 2 UBA2 Ubiquitin-like 1-activating enzyme E1B | Ubiquitin-like modifier-activating enzyme 2
Type:
Enzyme
Mol. Mass.:
71206.17
Organism:
Homo sapiens (Human)
Description:
Q9UBT2
Residue:
640
  
Inhibitor
Name:
BDBM329793
Synonyms:
(rac)-((1R,2R,3S,4R)-2,3-dihydroxy-4-(2-phenylpyrazolo[1,5-a]pyrimidin-7- US9663525, Compound I-001 | US9796725, Compound I-001
Type:
Small organic molecule
Emp. Form.:
C18H21N5O5S
Mol. Mass.:
419.455
SMILES:
NS(=O)(=O)OC[C@H]1C[C@@H](Nc2ccnc3cc(nn23)-c2ccccc2)[C@H](O)[C@@H]1O
: