Target
SUMO-activating enzyme subunit 2
Ligand
BDBM329880
Substrate
Meas. Tech.
HTRF Assay
IC50
55±n/a nM
Citation
 Afroze, RBharathan, ITCiavarri, JPFleming, PEGaulin, JLGirard, MLangston, SPSoucy, FWong, TYe, Y Pyrazolopyrimidinyl inhibitors of ubiquitin-activating enzyme US Patent  US9796725 Publication Date 10/24/2017 
Target
Name:
SUMO-activating enzyme subunit 2
Synonyms:
6.3.2.- SAE2 SUMO-activating enzyme subunit 2 UBA2 Ubiquitin-like 1-activating enzyme E1B | Ubiquitin-like modifier-activating enzyme 2
Type:
Enzyme
Mol. Mass.:
71206.17
Organism:
Homo sapiens (Human)
Description:
Q9UBT2
Residue:
640
  
Inhibitor
Name:
BDBM329880
Synonyms:
(rac)-((1R,2R,3S,4R)-4-(2-(6-chlorobenzo[b]thiophen-2-yl)pyrazolo[1,5-a]pyrimidin- US9663525, Compound I-088 | US9796725, Compound I-088
Type:
Small organic molecule
Emp. Form.:
C20H20ClN5O5S2
Mol. Mass.:
509.986
SMILES:
NS(=O)(=O)OC[C@H]1C[C@@H](Nc2ccnc3cc(nn23)-c2cc3ccc(Cl)cc3s2)[C@H](O)[C@@H]1O
: