Target
SUMO-activating enzyme subunit 2
Ligand
BDBM329882
Substrate
Meas. Tech.
HTRF Assay
IC50
<10±n/a nM
Citation
 Afroze, RBharathan, ITCiavarri, JPFleming, PEGaulin, JLGirard, MLangston, SPSoucy, FWong, TYe, Y Pyrazolopyrimidinyl inhibitors of ubiquitin-activating enzyme US Patent  US9796725 Publication Date 10/24/2017 
Target
Name:
SUMO-activating enzyme subunit 2
Synonyms:
6.3.2.- SAE2 SUMO-activating enzyme subunit 2 UBA2 Ubiquitin-like 1-activating enzyme E1B | Ubiquitin-like modifier-activating enzyme 2
Type:
Enzyme
Mol. Mass.:
71206.17
Organism:
Homo sapiens (Human)
Description:
Q9UBT2
Residue:
640
  
Inhibitor
Name:
BDBM329882
Synonyms:
(rac)-((1R,2R,3S,4R)-2,3-dihydroxy-4-(2-(3-(2-propoxypropan-2- US9663525, Compound I-090 | US9796725, Compound I-090
Type:
Small organic molecule
Emp. Form.:
C24H33N5O6S
Mol. Mass.:
519.614
SMILES:
CCCOC(C)(C)c1cccc(c1)-c1cc2nccc(N[C@@H]3C[C@H](COS(N)(=O)=O)[C@@H](O)[C@H]3O)n2n1
: